Date,age,sex,tribe,Religion,residentstate,geopoliticalzone,Cadre,willingnessforvaccination,vaccinatedornot,whenvaccinated,Anysideeffects,Painatinjectionsite,dizziness,headache,fever,chills,diarrhoea,musclepain,nausea,whynotvacc,willyouvacc,whynotgetvacc,recommendvaccine,attendedvaccine,involveinCOVIDcare,medicalcondition,specifymedcond,notsureofsafety,donttrust,notatrisk,noneedifinfected,dontbelieve,vaccinenotsafe,fearneedles,voluntary,notsurr,trustnot,atrisssk,noninfectt,believee,safee,feearr,voluu,attitudee,attituderecoded,willll,avai,recooo,acceeep,recoacc,attitude,agee
2021-03-23,38.0,2.0,1.0,1.0,21.0,1.0,1.0,2.0,2.0,,,,,,,,,,,1,7,7,2.0,2,1,2,,3,2,4,3,3,3,3,3,3.0,2.0,4.0,3.0,3.0,3.0,3.0,3.0,24.0,1.0,0.0,,0.0,0.0,1.0,24.0,2.0
2021-03-23,39.0,2.0,1.0,1.0,15.0,4.0,1.0,1.0,2.0,,,,,,,,,,,1,1,,1.0,1,1,2,,3,4,4,4,4,4,3,3,3.0,4.0,4.0,4.0,4.0,4.0,3.0,3.0,29.0,2.0,1.0,1.0,1.0,2.0,2.0,29.0,2.0
2021-03-24,38.0,1.0,1.0,1.0,22.0,1.0,1.0,1.0,2.0,,,,,,,,,,,1,1,,1.0,1,2,2,,2,3,3,4,4,4,4,2,2.0,3.0,3.0,4.0,4.0,4.0,4.0,2.0,26.0,1.0,1.0,1.0,1.0,2.0,2.0,26.0,2.0
2021-03-24,41.0,1.0,1.0,1.0,22.0,1.0,1.0,3.0,2.0,,,,,,,,,,,1,7,2,2.0,1,2,2,,1,1,5,3,3,1,5,1,1.0,1.0,5.0,3.0,3.0,1.0,5.0,1.0,20.0,1.0,0.0,,0.0,0.0,1.0,20.0,3.0
2021-03-24,36.0,2.0,1.0,1.0,15.0,4.0,1.0,2.0,2.0,,,,,,,,,,,1,3,8,1.0,1,2,2,,2,2,4,5,5,4,5,4,2.0,2.0,4.0,5.0,5.0,4.0,5.0,4.0,31.0,2.0,0.0,0.0,1.0,1.0,1.0,31.0,2.0
2021-03-24,38.0,2.0,1.0,2.0,16.0,1.0,1.0,1.0,1.0,1,1,1,2.00,1.00,1.00,2.00,2.00,1.00,2.00,,,,1.0,1,2,1,1,5,5,5,5,5,5,5,5,5.0,5.0,5.0,5.0,5.0,5.0,5.0,5.0,40.0,2.0,1.0,,1.0,2.0,2.0,40.0,2.0
2021-03-24,37.0,1.0,1.0,1.0,22.0,1.0,1.0,1.0,2.0,,,,,,,,,,,1,1,,1.0,1,1,2,,3,4,4,4,3,3,2,2,3.0,4.0,4.0,4.0,3.0,3.0,2.0,2.0,25.0,1.0,1.0,1.0,1.0,2.0,2.0,25.0,2.0
2021-03-24,34.0,2.0,1.0,1.0,22.0,1.0,1.0,1.0,1.0,3,2,,,,,,,,,,,,1.0,1,1,2,,4,5,4,4,4,5,5,2,4.0,5.0,4.0,4.0,4.0,5.0,5.0,2.0,33.0,2.0,1.0,,1.0,2.0,2.0,33.0,2.0
2021-03-24,38.0,1.0,1.0,1.0,21.0,1.0,1.0,3.0,2.0,,,,,,,,,,,3,7,8,3.0,1,1,2,,1,2,4,4,2,2,5,5,1.0,2.0,4.0,4.0,2.0,2.0,5.0,5.0,25.0,1.0,0.0,,0.0,0.0,1.0,25.0,2.0
2021-03-24,38.0,2.0,1.0,1.0,16.0,1.0,1.0,1.0,1.0,1,1,1,2.00,1.00,2.00,1.00,2.00,2.00,2.00,,,,1.0,2,2,2,,2,2,4,4,3,2,4,2,2.0,2.0,4.0,4.0,3.0,2.0,4.0,2.0,23.0,1.0,1.0,,1.0,2.0,2.0,23.0,2.0
2021-03-24,49.0,1.0,1.0,1.0,22.0,1.0,6.0,1.0,2.0,,,,,,,,,,,1,1,,1.0,1,2,2,,4,4,4,4,4,4,4,2,4.0,4.0,4.0,4.0,4.0,4.0,4.0,2.0,30.0,2.0,1.0,1.0,1.0,2.0,2.0,30.0,3.0
2021-03-24,35.0,1.0,1.0,2.0,15.0,4.0,1.0,1.0,2.0,,,,,,,,,,,1,1,,1.0,2,2,1,1,2,3,3,3,3,3,4,2,2.0,3.0,3.0,3.0,3.0,3.0,4.0,2.0,23.0,1.0,1.0,1.0,1.0,2.0,2.0,23.0,2.0
2021-03-24,37.0,1.0,1.0,1.0,22.0,1.0,1.0,1.0,2.0,,,,,,,,,,,1,1,,1.0,1,2,2,,4,4,4,4,4,4,2,2,4.0,4.0,4.0,4.0,4.0,4.0,2.0,2.0,28.0,1.0,1.0,1.0,1.0,2.0,2.0,28.0,2.0
2021-03-24,55.0,2.0,1.0,1.0,22.0,1.0,2.0,1.0,2.0,,,,,,,,,,,2,1,,1.0,1,2,1,2,5,1,5,5,5,1,1,1,5.0,1.0,5.0,5.0,5.0,1.0,1.0,1.0,24.0,1.0,1.0,1.0,1.0,2.0,2.0,24.0,3.0
2021-03-24,44.0,1.0,2.0,1.0,9.0,2.0,2.0,1.0,2.0,,,,,,,,,,,2,1,,1.0,1,2,1,2,5,1,5,5,5,1,1,1,5.0,1.0,5.0,5.0,5.0,1.0,1.0,1.0,24.0,1.0,1.0,1.0,1.0,2.0,2.0,24.0,3.0
2021-03-24,49.0,1.0,1.0,2.0,22.0,1.0,6.0,1.0,2.0,,,,,,,,,,,1,1,,1.0,1,1,2,,4,4,4,4,4,5,4,1,4.0,4.0,4.0,4.0,4.0,5.0,4.0,1.0,30.0,2.0,1.0,1.0,1.0,2.0,2.0,30.0,3.0
2021-03-24,32.0,1.0,2.0,1.0,6.0,2.0,2.0,1.0,2.0,,,,,,,,,,,1,1,,3.0,1,1,2,,4,1,4,4,5,4,3,1,4.0,1.0,4.0,4.0,5.0,4.0,3.0,1.0,26.0,1.0,1.0,1.0,0.0,1.0,1.0,26.0,2.0
2021-03-24,37.0,2.0,1.0,2.0,15.0,4.0,1.0,1.0,1.0,1,1,1,2.00,2.00,2.00,2.00,2.00,2.00,2.00,,,,1.0,1,2,2,,4,1,4,4,5,4,3,2,4.0,1.0,4.0,4.0,5.0,4.0,3.0,2.0,27.0,1.0,1.0,,1.0,2.0,2.0,27.0,2.0
2021-03-24,48.0,2.0,1.0,1.0,22.0,1.0,6.0,3.0,2.0,,,,,,,,,,,1,7,8,1.0,1,2,2,,2,3,4,4,4,4,4,2,2.0,3.0,4.0,4.0,4.0,4.0,4.0,2.0,27.0,1.0,0.0,,1.0,1.0,1.0,27.0,3.0
2021-03-24,52.0,2.0,1.0,2.0,22.0,1.0,6.0,1.0,2.0,,,,,,,,,,,2,1,,1.0,1,2,2,,4,4,2,4,4,4,4,4,4.0,4.0,2.0,4.0,4.0,4.0,4.0,4.0,30.0,2.0,1.0,1.0,1.0,2.0,2.0,30.0,3.0
2021-03-24,37.0,1.0,1.0,1.0,15.0,4.0,1.0,1.0,2.0,,,,,,,,,,,3,2,8,1.0,1,1,2,,2,2,3,4,2,2,3,1,2.0,2.0,3.0,4.0,2.0,2.0,3.0,1.0,19.0,1.0,1.0,0.0,1.0,2.0,2.0,19.0,2.0
2021-03-24,36.0,1.0,1.0,2.0,15.0,4.0,1.0,1.0,1.0,2,1,1,2.00,1.00,1.00,1.00,2.00,2.00,2.00,,,,1.0,1,1,2,,5,5,5,5,5,5,3,4,5.0,5.0,5.0,5.0,5.0,5.0,3.0,4.0,37.0,2.0,1.0,,1.0,2.0,2.0,37.0,2.0
2021-03-24,41.0,2.0,1.0,1.0,22.0,1.0,6.0,1.0,2.0,,,,,,,,,,,1,1,,1.0,1,2,1,1,2,4,4,4,4,4,4,4,2.0,4.0,4.0,4.0,4.0,4.0,4.0,4.0,30.0,2.0,1.0,1.0,1.0,2.0,2.0,30.0,3.0
2021-03-24,36.0,1.0,1.0,1.0,16.0,1.0,1.0,1.0,2.0,,,,,,,,,,,1,1,,1.0,1,1,2,,4,4,4,4,4,4,5,2,4.0,4.0,4.0,4.0,4.0,4.0,5.0,2.0,31.0,2.0,1.0,1.0,1.0,2.0,2.0,31.0,2.0
2021-03-24,35.0,1.0,1.0,2.0,7.0,3.0,1.0,1.0,1.0,,1,1,2.00,1.00,2.00,2.00,2.00,1.00,2.00,,,,2.0,1,1,2,,4,4,4,4,5,1,5,2,4.0,4.0,4.0,4.0,5.0,1.0,5.0,2.0,29.0,2.0,1.0,,0.0,1.0,1.0,29.0,2.0
2021-03-24,46.0,2.0,1.0,1.0,22.0,1.0,6.0,2.0,2.0,,,,,,,,,,,3,3,1,2.0,2,2,2,,2,3,4,4,4,4,5,2,2.0,3.0,4.0,4.0,4.0,4.0,5.0,2.0,28.0,1.0,0.0,0.0,0.0,0.0,1.0,28.0,3.0
2021-03-24,46.0,2.0,1.0,1.0,22.0,1.0,6.0,1.0,2.0,,,,,,,,,,,1,1,,1.0,1,2,2,,4,4,4,5,5,1,4,1,4.0,4.0,4.0,5.0,5.0,1.0,4.0,1.0,28.0,1.0,1.0,1.0,1.0,2.0,2.0,28.0,3.0
2021-03-24,36.0,1.0,1.0,1.0,16.0,1.0,1.0,1.0,1.0,1,1,1,2.00,2.00,1.00,1.00,2.00,1.00,2.00,,,,1.0,1,1,1,4,4,3,5,4,5,4,5,4,4.0,3.0,5.0,4.0,5.0,4.0,5.0,4.0,34.0,2.0,1.0,,1.0,2.0,2.0,34.0,2.0
2021-03-24,50.0,2.0,1.0,1.0,22.0,1.0,6.0,1.0,2.0,,,,,,,,,,,1,1,,1.0,1,2,1,1,1,4,5,5,5,5,4,1,1.0,4.0,5.0,5.0,5.0,5.0,4.0,1.0,30.0,2.0,1.0,1.0,1.0,2.0,2.0,30.0,3.0
2021-03-24,50.0,2.0,1.0,2.0,22.0,1.0,6.0,1.0,2.0,,,,,,,,,,,2,1,,1.0,1,2,2,,4,4,4,4,4,5,4,4,4.0,4.0,4.0,4.0,4.0,5.0,4.0,4.0,33.0,2.0,1.0,1.0,1.0,2.0,2.0,33.0,3.0
2021-03-24,58.0,2.0,1.0,1.0,22.0,1.0,2.0,1.0,2.0,,,,,,,,,,,1,1,,1.0,1,2,2,,4,4,5,5,5,5,4,5,4.0,4.0,5.0,5.0,5.0,5.0,4.0,5.0,37.0,2.0,1.0,1.0,1.0,2.0,2.0,37.0,3.0
2021-03-24,57.0,2.0,1.0,1.0,8.0,1.0,2.0,1.0,2.0,,,,,,,,,,,1,1,,1.0,1,2,1,3,4,4,4,5,4,5,2,2,4.0,4.0,4.0,5.0,4.0,5.0,2.0,2.0,30.0,2.0,1.0,1.0,1.0,2.0,2.0,30.0,3.0
2021-03-24,33.0,1.0,1.0,1.0,20.0,1.0,1.0,1.0,1.0,1,1,1,1.00,1.00,2.00,2.00,2.00,2.00,2.00,,,,1.0,2,1,2,,3,2,5,5,5,5,5,1,3.0,2.0,5.0,5.0,5.0,5.0,5.0,1.0,31.0,2.0,1.0,,1.0,2.0,2.0,31.0,2.0
2021-03-24,35.0,1.0,1.0,1.0,22.0,1.0,1.0,3.0,2.0,,,,,,,,,,,1,7,8,1.0,1,2,2,,4,5,5,5,5,5,5,2,4.0,5.0,5.0,5.0,5.0,5.0,5.0,2.0,36.0,2.0,0.0,,1.0,1.0,1.0,36.0,2.0
2021-03-24,40.0,1.0,1.0,1.0,16.0,1.0,1.0,3.0,2.0,,,,,,,,,,,3,4,8,1.0,1,1,2,,1,3,2,4,3,3,5,1,1.0,3.0,2.0,4.0,3.0,3.0,5.0,1.0,22.0,1.0,0.0,,1.0,1.0,1.0,22.0,2.0
2021-03-24,40.0,2.0,1.0,1.0,22.0,1.0,6.0,1.0,2.0,,,,,,,,,,,1,1,,1.0,1,2,2,,4,5,4,4,4,5,5,5,4.0,5.0,4.0,4.0,4.0,5.0,5.0,5.0,36.0,2.0,1.0,1.0,1.0,2.0,2.0,36.0,2.0
2021-03-24,42.0,1.0,1.0,2.0,22.0,1.0,6.0,1.0,2.0,,,,,,,,,,,1,1,,1.0,1,1,2,,5,5,5,5,5,5,4,2,5.0,5.0,5.0,5.0,5.0,5.0,4.0,2.0,36.0,2.0,1.0,1.0,1.0,2.0,2.0,36.0,3.0
2021-03-24,41.0,2.0,1.0,1.0,22.0,1.0,6.0,1.0,2.0,,,,,,,,,,,1,1,,1.0,1,2,2,,4,4,4,4,4,4,4,2,4.0,4.0,4.0,4.0,4.0,4.0,4.0,2.0,30.0,2.0,1.0,1.0,1.0,2.0,2.0,30.0,3.0
2021-03-24,44.0,2.0,1.0,2.0,22.0,1.0,6.0,1.0,2.0,,,,,,,,,,,1,1,,1.0,1,2,2,,2,4,4,4,4,4,4,4,2.0,4.0,4.0,4.0,4.0,4.0,4.0,4.0,30.0,2.0,1.0,1.0,1.0,2.0,2.0,30.0,3.0
2021-03-24,45.0,2.0,1.0,1.0,22.0,1.0,6.0,1.0,2.0,,,,,,,,,,,2,1,,1.0,1,2,2,,4,4,2,5,4,5,5,2,4.0,4.0,2.0,5.0,4.0,5.0,5.0,2.0,31.0,2.0,1.0,1.0,1.0,2.0,2.0,31.0,3.0
2021-03-24,52.0,2.0,1.0,1.0,22.0,1.0,6.0,1.0,2.0,,,,,,,,,,,2,1,,1.0,1,2,2,,1,5,1,5,5,5,5,5,1.0,5.0,1.0,5.0,5.0,5.0,5.0,5.0,32.0,2.0,1.0,1.0,1.0,2.0,2.0,32.0,3.0
2021-03-24,49.0,2.0,1.0,1.0,22.0,1.0,6.0,1.0,2.0,,,,,,,,,,,1,1,,1.0,1,2,2,,5,5,4,4,1,5,4,1,5.0,5.0,4.0,4.0,1.0,5.0,4.0,1.0,29.0,2.0,1.0,1.0,1.0,2.0,2.0,29.0,3.0
2021-03-24,40.0,2.0,1.0,1.0,22.0,1.0,6.0,1.0,2.0,,,,,,,,,,,2,1,,1.0,1,2,2,,5,4,1,5,5,5,2,1,5.0,4.0,1.0,5.0,5.0,5.0,2.0,1.0,28.0,1.0,1.0,1.0,1.0,2.0,2.0,28.0,2.0
2021-03-24,51.0,2.0,1.0,1.0,22.0,1.0,6.0,1.0,2.0,,,,,,,,,,,1,1,,1.0,1,2,1,1,5,5,5,5,5,5,5,5,5.0,5.0,5.0,5.0,5.0,5.0,5.0,5.0,40.0,2.0,1.0,1.0,1.0,2.0,2.0,40.0,3.0
2021-03-24,51.0,2.0,1.0,2.0,22.0,1.0,6.0,1.0,2.0,,,,,,,,,,,1,1,,1.0,1,1,2,,1,5,1,5,5,1,5,1,1.0,5.0,1.0,5.0,5.0,1.0,5.0,1.0,24.0,1.0,1.0,1.0,1.0,2.0,2.0,24.0,3.0
2021-03-24,40.0,2.0,1.0,1.0,22.0,1.0,2.0,1.0,2.0,,,,,,,,,,,1,1,,1.0,1,2,2,,4,5,5,4,5,1,5,4,4.0,5.0,5.0,4.0,5.0,1.0,5.0,4.0,33.0,2.0,1.0,1.0,1.0,2.0,2.0,33.0,2.0
2021-03-24,52.0,2.0,1.0,1.0,22.0,1.0,2.0,1.0,2.0,,,,,,,,,,,2,1,,1.0,1,2,2,,1,5,2,5,5,5,5,2,1.0,5.0,2.0,5.0,5.0,5.0,5.0,2.0,30.0,2.0,1.0,1.0,1.0,2.0,2.0,30.0,3.0
2021-03-24,35.0,2.0,1.0,1.0,16.0,1.0,1.0,1.0,1.0,1,1,1,2.00,2.00,2.00,2.00,2.00,2.00,2.00,,,,1.0,1,1,2,,4,4,4,4,4,4,4,2,4.0,4.0,4.0,4.0,4.0,4.0,4.0,2.0,30.0,2.0,1.0,,1.0,2.0,2.0,30.0,2.0
2021-03-24,41.0,1.0,1.0,1.0,14.0,4.0,1.0,1.0,2.0,,,,,,,,,,,2,1,,1.0,1,1,2,,4,4,5,5,5,4,3,2,4.0,4.0,5.0,5.0,5.0,4.0,3.0,2.0,32.0,2.0,1.0,1.0,1.0,2.0,2.0,32.0,3.0
2021-03-24,35.0,2.0,4.0,1.0,7.0,3.0,1.0,1.0,1.0,1,1,1,1.00,1.00,2.00,2.00,2.00,1.00,2.00,,,,2.0,1,1,1,1,3,3,5,5,4,5,1,1,3.0,3.0,5.0,5.0,4.0,5.0,1.0,1.0,27.0,1.0,1.0,,0.0,1.0,1.0,27.0,2.0
2021-03-24,50.0,2.0,1.0,1.0,22.0,1.0,6.0,1.0,2.0,,,,,,,,,,,2,1,,1.0,1,1,2,,4,5,5,5,5,1,1,5,4.0,5.0,5.0,5.0,5.0,1.0,1.0,5.0,31.0,2.0,1.0,1.0,1.0,2.0,2.0,31.0,3.0
2021-03-24,38.0,1.0,4.0,1.0,7.0,3.0,1.0,1.0,2.0,,,,,,,,,,,1,1,,1.0,2,2,2,,3,3,2,4,4,4,5,2,3.0,3.0,2.0,4.0,4.0,4.0,5.0,2.0,27.0,1.0,1.0,1.0,1.0,2.0,2.0,27.0,2.0
2021-03-24,44.0,2.0,1.0,1.0,22.0,1.0,6.0,1.0,2.0,,,,,,,,,,,1,1,,1.0,1,2,1,1,5,5,5,5,5,5,5,5,5.0,5.0,5.0,5.0,5.0,5.0,5.0,5.0,40.0,2.0,1.0,1.0,1.0,2.0,2.0,40.0,3.0
2021-03-24,39.0,1.0,4.0,1.0,23.0,4.0,1.0,1.0,1.0,1,1,1,1.00,2.00,1.00,2.00,2.00,2.00,2.00,,,,1.0,1,1,2,,4,3,5,5,5,4,5,3,4.0,3.0,5.0,5.0,5.0,4.0,5.0,3.0,34.0,2.0,1.0,,1.0,2.0,2.0,34.0,2.0
2021-03-24,32.0,1.0,1.0,2.0,22.0,1.0,3.0,1.0,2.0,,,,,,,,,,,1,1,,3.0,2,2,2,,4,4,4,5,5,5,5,5,4.0,4.0,4.0,5.0,5.0,5.0,5.0,5.0,37.0,2.0,1.0,1.0,0.0,1.0,1.0,37.0,2.0
2021-03-24,39.0,1.0,1.0,1.0,8.0,1.0,1.0,1.0,1.0,1,1,1,2.00,2.00,2.00,2.00,2.00,2.00,2.00,,,,1.0,1,2,2,,1,2,3,2,3,3,4,4,1.0,2.0,3.0,2.0,3.0,3.0,4.0,4.0,22.0,1.0,1.0,,1.0,2.0,2.0,22.0,2.0
2021-03-24,54.0,1.0,1.0,1.0,22.0,1.0,1.0,1.0,2.0,,,,,,,,,,,1,1,,1.0,1,2,2,,4,5,1,4,4,4,4,2,4.0,5.0,1.0,4.0,4.0,4.0,4.0,2.0,28.0,1.0,1.0,1.0,1.0,2.0,2.0,28.0,3.0
2021-03-24,36.0,2.0,4.0,1.0,19.0,1.0,1.0,3.0,2.0,,,,,,,,,,,1,5,8,3.0,1,2,2,,1,5,1,5,4,4,5,1,1.0,5.0,1.0,5.0,4.0,4.0,5.0,1.0,26.0,1.0,0.0,,0.0,0.0,1.0,26.0,2.0
2021-03-24,37.0,2.0,1.0,1.0,22.0,1.0,1.0,3.0,2.0,,,,,,,,,,,3,7,2,3.0,1,1,2,,1,3,3,3,1,3,5,2,1.0,3.0,3.0,3.0,1.0,3.0,5.0,2.0,21.0,1.0,0.0,,0.0,0.0,1.0,21.0,2.0
2021-03-24,38.0,1.0,4.0,1.0,12.0,4.0,1.0,1.0,1.0,1,1,1,2.00,2.00,2.00,2.00,2.00,1.00,2.00,,,,3.0,1,2,2,,2,3,1,4,4,4,4,2,2.0,3.0,1.0,4.0,4.0,4.0,4.0,2.0,24.0,1.0,1.0,,0.0,1.0,1.0,24.0,2.0
2021-03-24,39.0,1.0,2.0,1.0,5.0,3.0,1.0,1.0,1.0,1,1,1,2.00,2.00,1.00,2.00,2.00,1.00,1.00,,,,1.0,1,1,2,,2,3,4,4,4,4,4,2,2.0,3.0,4.0,4.0,4.0,4.0,4.0,2.0,27.0,1.0,1.0,,1.0,2.0,2.0,27.0,2.0
2021-03-24,37.0,2.0,1.0,1.0,22.0,1.0,1.0,3.0,2.0,,,,,,,,,,,1,7,8,3.0,1,1,2,,2,4,3,4,4,5,5,1,2.0,4.0,3.0,4.0,4.0,5.0,5.0,1.0,28.0,1.0,0.0,,0.0,0.0,1.0,28.0,2.0
2021-03-24,51.0,2.0,1.0,1.0,22.0,1.0,2.0,1.0,2.0,,,,,,,,,,,1,1,,1.0,1,2,2,,3,4,4,5,4,5,2,4,3.0,4.0,4.0,5.0,4.0,5.0,2.0,4.0,31.0,2.0,1.0,1.0,1.0,2.0,2.0,31.0,3.0
2021-03-24,32.0,1.0,1.0,1.0,16.0,1.0,1.0,1.0,1.0,1,1,2,1.00,2.00,2.00,2.00,2.00,2.00,2.00,,,,1.0,1,1,2,,3,3,4,4,4,4,2,2,3.0,3.0,4.0,4.0,4.0,4.0,2.0,2.0,26.0,1.0,1.0,,1.0,2.0,2.0,26.0,2.0
2021-03-24,34.0,1.0,1.0,1.0,22.0,1.0,3.0,1.0,2.0,,,,,,,,,,,1,1,,1.0,1,1,2,,3,5,4,3,5,5,5,2,3.0,5.0,4.0,3.0,5.0,5.0,5.0,2.0,32.0,2.0,1.0,1.0,1.0,2.0,2.0,32.0,2.0
2021-03-24,34.0,1.0,1.0,1.0,22.0,1.0,3.0,1.0,2.0,,,,,,,,,,,1,1,,1.0,1,1,2,,3,5,4,3,5,5,5,2,3.0,5.0,4.0,3.0,5.0,5.0,5.0,2.0,32.0,2.0,1.0,1.0,1.0,2.0,2.0,32.0,2.0
2021-03-24,32.0,2.0,1.0,1.0,22.0,1.0,6.0,1.0,2.0,,,,,,,,,,,1,1,,1.0,1,2,2,,4,4,4,4,4,5,5,2,4.0,4.0,4.0,4.0,4.0,5.0,5.0,2.0,32.0,2.0,1.0,1.0,1.0,2.0,2.0,32.0,2.0
2021-03-24,40.0,2.0,4.0,1.0,7.0,3.0,1.0,1.0,2.0,,,,,,,,,,,1,1,,1.0,1,2,2,,5,2,5,5,5,5,5,2,5.0,2.0,5.0,5.0,5.0,5.0,5.0,2.0,34.0,2.0,1.0,1.0,1.0,2.0,2.0,34.0,2.0
2021-03-24,43.0,2.0,1.0,2.0,21.0,1.0,6.0,1.0,2.0,,,,,,,,,,,1,1,,1.0,1,2,2,,1,5,5,5,5,5,5,5,1.0,5.0,5.0,5.0,5.0,5.0,5.0,5.0,36.0,2.0,1.0,1.0,1.0,2.0,2.0,36.0,3.0
2021-03-24,38.0,2.0,1.0,2.0,20.0,1.0,6.0,1.0,2.0,,,,,,,,,,,1,1,,1.0,1,2,2,,1,5,5,5,5,5,5,5,1.0,5.0,5.0,5.0,5.0,5.0,5.0,5.0,36.0,2.0,1.0,1.0,1.0,2.0,2.0,36.0,2.0
2021-03-24,43.0,1.0,1.0,2.0,22.0,1.0,6.0,1.0,2.0,,,,,,,,,,,1,1,,1.0,1,1,2,,4,4,1,5,5,5,5,5,4.0,4.0,1.0,5.0,5.0,5.0,5.0,5.0,34.0,2.0,1.0,1.0,1.0,2.0,2.0,34.0,3.0
2021-03-24,37.0,1.0,1.0,2.0,18.0,4.0,1.0,1.0,2.0,,,,,,,,,,,1,1,,1.0,1,2,2,,4,4,5,3,5,5,4,5,4.0,4.0,5.0,3.0,5.0,5.0,4.0,5.0,35.0,2.0,1.0,1.0,1.0,2.0,2.0,35.0,2.0
2021-03-24,49.0,2.0,1.0,2.0,22.0,1.0,6.0,1.0,2.0,,,,,,,,,,,1,1,,1.0,1,2,2,,4,4,4,4,4,4,2,2,4.0,4.0,4.0,4.0,4.0,4.0,2.0,2.0,28.0,1.0,1.0,1.0,1.0,2.0,2.0,28.0,3.0
2021-03-24,35.0,1.0,1.0,1.0,21.0,1.0,1.0,3.0,2.0,,,,,,,,,,,1,5,,3.0,1,1,2,,2,1,4,4,3,3,5,1,2.0,1.0,4.0,4.0,3.0,3.0,5.0,1.0,23.0,1.0,0.0,,0.0,0.0,1.0,23.0,2.0
2021-03-24,50.0,2.0,1.0,1.0,22.0,1.0,6.0,1.0,2.0,,,,,,,,,,,1,1,,1.0,1,2,2,,4,4,2,4,4,4,4,4,4.0,4.0,2.0,4.0,4.0,4.0,4.0,4.0,30.0,2.0,1.0,1.0,1.0,2.0,2.0,30.0,3.0
2021-03-24,39.0,2.0,1.0,1.0,19.0,1.0,6.0,1.0,2.0,,,,,,,,,,,2,1,,1.0,2,1,2,,4,4,2,2,5,5,3,2,4.0,4.0,2.0,2.0,5.0,5.0,3.0,2.0,27.0,1.0,1.0,1.0,1.0,2.0,2.0,27.0,2.0
2021-03-24,49.0,2.0,1.0,2.0,22.0,1.0,6.0,1.0,2.0,,,,,,,,,,,1,1,,1.0,1,2,2,,5,1,5,5,5,1,1,1,5.0,1.0,5.0,5.0,5.0,1.0,1.0,1.0,24.0,1.0,1.0,1.0,1.0,2.0,2.0,24.0,3.0
2021-03-24,49.0,2.0,1.0,2.0,22.0,1.0,6.0,1.0,2.0,,,,,,,,,,,1,2,8,1.0,1,2,3,,5,5,5,5,5,5,5,2,5.0,5.0,5.0,5.0,5.0,5.0,5.0,2.0,37.0,2.0,1.0,0.0,1.0,2.0,2.0,37.0,3.0
2021-03-24,39.0,2.0,1.0,1.0,22.0,1.0,6.0,1.0,2.0,,,,,,,,,,,1,1,,1.0,1,2,2,,5,5,5,5,5,5,3,1,5.0,5.0,5.0,5.0,5.0,5.0,3.0,1.0,34.0,2.0,1.0,1.0,1.0,2.0,2.0,34.0,2.0
2021-03-24,47.0,2.0,1.0,1.0,22.0,1.0,6.0,1.0,2.0,,,,,,,,,,,1,1,,1.0,1,1,2,,4,4,4,4,4,4,4,4,4.0,4.0,4.0,4.0,4.0,4.0,4.0,4.0,32.0,2.0,1.0,1.0,1.0,2.0,2.0,32.0,3.0
2021-03-24,37.0,1.0,1.0,2.0,22.0,1.0,6.0,1.0,2.0,,,,,,,,,,,1,1,,1.0,2,1,2,,5,1,4,4,4,1,2,2,5.0,1.0,4.0,4.0,4.0,1.0,2.0,2.0,23.0,1.0,1.0,1.0,1.0,2.0,2.0,23.0,2.0
2021-03-24,45.0,2.0,1.0,2.0,22.0,1.0,7.0,1.0,2.0,,,,,,,,,,,1,1,,1.0,1,2,2,,5,1,5,5,5,5,5,1,5.0,1.0,5.0,5.0,5.0,5.0,5.0,1.0,32.0,2.0,1.0,1.0,1.0,2.0,2.0,32.0,3.0
2021-03-24,57.0,2.0,1.0,1.0,22.0,1.0,6.0,1.0,2.0,,,,,,,,,,,1,1,,1.0,1,1,1,5,5,5,5,5,5,5,5,1,5.0,5.0,5.0,5.0,5.0,5.0,5.0,1.0,36.0,2.0,1.0,1.0,1.0,2.0,2.0,36.0,3.0
2021-03-24,39.0,2.0,1.0,1.0,22.0,1.0,6.0,1.0,2.0,,,,,,,,,,,1,1,,1.0,1,1,2,,1,4,1,2,4,1,4,2,1.0,4.0,1.0,2.0,4.0,1.0,4.0,2.0,19.0,1.0,1.0,1.0,1.0,2.0,2.0,19.0,2.0
2021-03-24,54.0,1.0,1.0,1.0,21.0,1.0,3.0,1.0,2.0,,,,,,,,,,,1,1,,1.0,1,1,2,,5,5,5,5,5,5,5,2,5.0,5.0,5.0,5.0,5.0,5.0,5.0,2.0,37.0,2.0,1.0,1.0,1.0,2.0,2.0,37.0,3.0
2021-03-24,32.0,2.0,1.0,1.0,21.0,1.0,1.0,1.0,2.0,,,,,,,,,,,1,1,,1.0,1,1,2,,1,4,1,2,4,4,4,2,1.0,4.0,1.0,2.0,4.0,4.0,4.0,2.0,22.0,1.0,1.0,1.0,1.0,2.0,2.0,22.0,2.0
2021-03-24,39.0,2.0,1.0,1.0,22.0,1.0,6.0,1.0,2.0,,,,,,,,,,,1,1,,1.0,1,2,2,,1,4,4,5,4,5,5,2,1.0,4.0,4.0,5.0,4.0,5.0,5.0,2.0,30.0,2.0,1.0,1.0,1.0,2.0,2.0,30.0,2.0
2021-03-25,43.0,1.0,1.0,2.0,22.0,1.0,1.0,1.0,2.0,,,,,,,,,,,1,1,,1.0,1,1,1,1,1,1,5,4,5,5,5,2,1.0,1.0,5.0,4.0,5.0,5.0,5.0,2.0,28.0,1.0,1.0,1.0,1.0,2.0,2.0,28.0,3.0
2021-03-25,50.0,2.0,1.0,2.0,22.0,1.0,6.0,1.0,2.0,,,,,,,,,,,1,1,,1.0,1,2,2,,5,5,5,5,5,5,5,1,5.0,5.0,5.0,5.0,5.0,5.0,5.0,1.0,36.0,2.0,1.0,1.0,1.0,2.0,2.0,36.0,3.0
2021-03-25,53.0,2.0,1.0,1.0,22.0,1.0,6.0,1.0,2.0,,,,,,,,,,,1,1,,1.0,1,2,1,1,4,2,1,5,4,4,4,2,4.0,2.0,1.0,5.0,4.0,4.0,4.0,2.0,26.0,1.0,1.0,1.0,1.0,2.0,2.0,26.0,3.0
2021-03-25,38.0,2.0,1.0,2.0,22.0,1.0,6.0,1.0,2.0,,,,,,,,,,,1,1,,1.0,1,2,2,,2,4,5,4,4,4,4,2,2.0,4.0,5.0,4.0,4.0,4.0,4.0,2.0,29.0,2.0,1.0,1.0,1.0,2.0,2.0,29.0,2.0
2021-03-25,50.0,2.0,1.0,2.0,22.0,1.0,6.0,1.0,2.0,,,,,,,,,,,2,1,,1.0,1,2,2,,4,4,5,4,4,5,4,1,4.0,4.0,5.0,4.0,4.0,5.0,4.0,1.0,31.0,2.0,1.0,1.0,1.0,2.0,2.0,31.0,3.0
2021-03-25,51.0,2.0,1.0,1.0,22.0,1.0,6.0,1.0,2.0,,,,,,,,,,,1,1,,1.0,1,2,3,,4,4,2,2,4,4,5,2,4.0,4.0,2.0,2.0,4.0,4.0,5.0,2.0,27.0,1.0,1.0,1.0,1.0,2.0,2.0,27.0,3.0
2021-03-25,36.0,2.0,4.0,1.0,22.0,1.0,6.0,1.0,2.0,,,,,,,,,,,1,1,,1.0,1,2,2,,4,4,4,4,4,4,4,4,4.0,4.0,4.0,4.0,4.0,4.0,4.0,4.0,32.0,2.0,1.0,1.0,1.0,2.0,2.0,32.0,2.0
2021-03-25,47.0,2.0,1.0,1.0,22.0,1.0,6.0,1.0,2.0,,,,,,,,,,,1,1,,1.0,1,2,2,,4,5,5,5,5,5,5,5,4.0,5.0,5.0,5.0,5.0,5.0,5.0,5.0,39.0,2.0,1.0,1.0,1.0,2.0,2.0,39.0,3.0
2021-03-25,40.0,1.0,1.0,1.0,10.0,4.0,1.0,1.0,1.0,1,1,1,2.00,1.00,1.00,1.00,2.00,2.00,2.00,,,,1.0,1,1,2,,3,4,3,3,4,5,3,5,3.0,4.0,3.0,3.0,4.0,5.0,3.0,5.0,30.0,2.0,1.0,,1.0,2.0,2.0,30.0,2.0
2021-03-25,46.0,2.0,1.0,1.0,22.0,1.0,1.0,1.0,2.0,,,,,,,,,,,1,1,,1.0,1,1,2,,4,4,2,4,4,5,2,4,4.0,4.0,2.0,4.0,4.0,5.0,2.0,4.0,29.0,2.0,1.0,1.0,1.0,2.0,2.0,29.0,3.0
2021-03-25,43.0,2.0,2.0,1.0,16.0,1.0,1.0,1.0,1.0,2,1,1,2.00,2.00,2.00,1.00,2.00,1.00,2.00,,,,1.0,1,2,2,,5,5,5,5,5,5,5,3,5.0,5.0,5.0,5.0,5.0,5.0,5.0,3.0,38.0,2.0,1.0,,1.0,2.0,2.0,38.0,3.0
2021-03-25,54.0,2.0,1.0,1.0,22.0,1.0,2.0,1.0,2.0,,,,,,,,,,,1,1,,1.0,1,2,2,,3,4,4,4,3,3,4,2,3.0,4.0,4.0,4.0,3.0,3.0,4.0,2.0,27.0,1.0,1.0,1.0,1.0,2.0,2.0,27.0,3.0
2021-03-25,56.0,2.0,1.0,1.0,22.0,1.0,2.0,1.0,2.0,,,,,,,,,,,2,1,,1.0,1,1,2,,2,2,4,4,2,3,4,1,2.0,2.0,4.0,4.0,2.0,3.0,4.0,1.0,22.0,1.0,1.0,1.0,1.0,2.0,2.0,22.0,3.0
2021-03-25,43.0,2.0,1.0,2.0,22.0,1.0,6.0,1.0,2.0,,,,,,,,,,,1,1,,1.0,1,2,2,,4,4,4,4,3,4,4,4,4.0,4.0,4.0,4.0,3.0,4.0,4.0,4.0,31.0,2.0,1.0,1.0,1.0,2.0,2.0,31.0,3.0
2021-03-25,40.0,1.0,1.0,1.0,21.0,1.0,1.0,1.0,1.0,1,1,1,1.00,1.00,1.00,1.00,2.00,1.00,2.00,,,,1.0,2,2,2,,3,2,4,5,3,4,3,3,3.0,2.0,4.0,5.0,3.0,4.0,3.0,3.0,27.0,1.0,1.0,,1.0,2.0,2.0,27.0,2.0
2021-03-25,28.0,1.0,2.0,1.0,1.0,2.0,7.0,1.0,2.0,,,,,,,,,,,1,2,4,1.0,1,2,2,,2,2,4,4,4,4,2,5,2.0,2.0,4.0,4.0,4.0,4.0,2.0,5.0,27.0,1.0,1.0,0.0,1.0,2.0,2.0,27.0,2.0
2021-03-25,45.0,2.0,1.0,1.0,22.0,1.0,6.0,1.0,2.0,,,,,,,,,,,1,1,,1.0,1,2,2,,1,1,5,4,4,4,4,1,1.0,1.0,5.0,4.0,4.0,4.0,4.0,1.0,24.0,1.0,1.0,1.0,1.0,2.0,2.0,24.0,3.0
2021-03-25,41.0,1.0,2.0,1.0,9.0,2.0,1.0,1.0,1.0,1,2,,,,,,,,,,,,1.0,1,2,1,3,4,4,4,3,5,5,5,1,4.0,4.0,4.0,3.0,5.0,5.0,5.0,1.0,31.0,2.0,1.0,,1.0,2.0,2.0,31.0,3.0
2021-03-25,69.0,1.0,2.0,1.0,24.0,3.0,1.0,1.0,1.0,1,1,1,2.00,2.00,2.00,2.00,2.00,2.00,2.00,,,,1.0,,2,1,6,4,4,4,4,5,5,5,5,4.0,4.0,4.0,4.0,5.0,5.0,5.0,5.0,36.0,2.0,1.0,,1.0,2.0,2.0,36.0,4.0
2021-03-25,52.0,1.0,3.0,2.0,13.0,6.0,1.0,1.0,1.0,1,2,,,,,,,,,,,,1.0,1,1,2,,2,3,4,4,4,4,4,4,2.0,3.0,4.0,4.0,4.0,4.0,4.0,4.0,29.0,2.0,1.0,,1.0,2.0,2.0,29.0,3.0
2021-03-25,44.0,2.0,1.0,1.0,16.0,1.0,1.0,1.0,1.0,1,1,1,2.00,2.00,2.00,2.00,2.00,2.00,2.00,,,,1.0,1,1,2,,2,4,5,5,5,4,3,2,2.0,4.0,5.0,5.0,5.0,4.0,3.0,2.0,30.0,2.0,1.0,,1.0,2.0,2.0,30.0,3.0
2021-03-25,51.0,2.0,1.0,1.0,22.0,1.0,6.0,1.0,2.0,,,,,,,,,,,1,1,,1.0,1,2,2,,4,4,4,4,4,4,4,2,4.0,4.0,4.0,4.0,4.0,4.0,4.0,2.0,30.0,2.0,1.0,1.0,1.0,2.0,2.0,30.0,3.0
2021-03-25,44.0,1.0,4.0,1.0,12.0,4.0,1.0,1.0,1.0,1,1,1,1.00,1.00,2.00,2.00,2.00,1.00,2.00,,,,1.0,1,2,2,,5,5,5,5,5,5,1,1,5.0,5.0,5.0,5.0,5.0,5.0,1.0,1.0,32.0,2.0,1.0,,1.0,2.0,2.0,32.0,3.0
2021-03-25,65.0,2.0,2.0,1.0,1.0,2.0,1.0,3.0,2.0,,,,,,,,,,,3,3,4,3.0,1,1,1,7,1,2,4,4,2,2,5,1,1.0,2.0,4.0,4.0,2.0,2.0,5.0,1.0,21.0,1.0,0.0,0.0,0.0,0.0,1.0,21.0,4.0
2021-03-25,47.0,2.0,1.0,1.0,22.0,1.0,6.0,1.0,2.0,,,,,,,,,,,1,1,,1.0,1,2,2,,4,4,4,4,4,4,4,4,4.0,4.0,4.0,4.0,4.0,4.0,4.0,4.0,32.0,2.0,1.0,1.0,1.0,2.0,2.0,32.0,3.0
2021-03-25,34.0,2.0,1.0,1.0,10.0,4.0,1.0,1.0,2.0,,,,,,,,,,,1,1,,1.0,1,1,2,,3,2,5,4,4,4,1,1,3.0,2.0,5.0,4.0,4.0,4.0,1.0,1.0,24.0,1.0,1.0,1.0,1.0,2.0,2.0,24.0,2.0
2021-03-25,48.0,2.0,2.0,1.0,1.0,2.0,1.0,2.0,2.0,,,,,,,,,,,3,5,4,2.0,1,2,2,,3,3,4,4,3,3,3,1,3.0,3.0,4.0,4.0,3.0,3.0,3.0,1.0,24.0,1.0,0.0,,0.0,0.0,1.0,24.0,3.0
2021-03-25,49.0,2.0,1.0,1.0,22.0,1.0,6.0,1.0,2.0,,,,,,,,,,,1,1,,1.0,1,2,2,,4,4,4,4,4,4,4,2,4.0,4.0,4.0,4.0,4.0,4.0,4.0,2.0,30.0,2.0,1.0,1.0,1.0,2.0,2.0,30.0,3.0
2021-03-25,57.0,2.0,1.0,1.0,2.0,4.0,1.0,3.0,2.0,,,,,,,,,,,1,1,,3.0,1,2,2,,5,5,5,5,5,5,5,4,5.0,5.0,5.0,5.0,5.0,5.0,5.0,4.0,39.0,2.0,0.0,1.0,0.0,0.0,1.0,39.0,3.0
2021-03-25,34.0,1.0,1.0,2.0,16.0,1.0,3.0,3.0,2.0,,,,,,,,,,,3,4,8,3.0,1,1,1,1,2,2,4,5,3,3,4,1,2.0,2.0,4.0,5.0,3.0,3.0,4.0,1.0,24.0,1.0,0.0,,0.0,0.0,1.0,24.0,2.0
2021-03-25,43.0,2.0,1.0,1.0,22.0,1.0,3.0,1.0,2.0,,,,,,,,,,,1,1,,1.0,1,2,2,,3,2,2,5,4,4,4,2,3.0,2.0,2.0,5.0,4.0,4.0,4.0,2.0,26.0,1.0,1.0,1.0,1.0,2.0,2.0,26.0,3.0
2021-03-25,30.0,1.0,1.0,1.0,5.0,3.0,3.0,1.0,2.0,,,,,,,,,,,1,1,,1.0,1,1,2,,3,3,4,5,4,4,5,1,3.0,3.0,4.0,5.0,4.0,4.0,5.0,1.0,29.0,2.0,1.0,1.0,1.0,2.0,2.0,29.0,2.0
2021-03-25,46.0,2.0,4.0,1.0,10.0,4.0,1.0,1.0,1.0,2,1,1,2.00,2.00,1.00,2.00,2.00,1.00,2.00,,,,1.0,1,2,1,1,5,5,4,5,5,5,2,5,5.0,5.0,4.0,5.0,5.0,5.0,2.0,5.0,36.0,2.0,1.0,,1.0,2.0,2.0,36.0,3.0
2021-03-25,35.0,1.0,1.0,1.0,16.0,1.0,3.0,1.0,1.0,,1,1,2.00,1.00,1.00,2.00,2.00,2.00,2.00,,,,1.0,1,2,2,,3,4,4,4,3,4,5,2,3.0,4.0,4.0,4.0,3.0,4.0,5.0,2.0,29.0,2.0,1.0,,1.0,2.0,2.0,29.0,2.0
2021-03-25,35.0,1.0,1.0,1.0,22.0,1.0,3.0,1.0,2.0,,,,,,,,,,,1,4,8,1.0,1,1,2,,2,4,5,3,5,5,3,5,2.0,4.0,5.0,3.0,5.0,5.0,3.0,5.0,32.0,2.0,1.0,,1.0,2.0,2.0,32.0,2.0
2021-03-25,27.0,2.0,1.0,2.0,20.0,1.0,3.0,3.0,2.0,,,,,,,,,,,3,3,1,3.0,1,1,2,,2,2,4,3,3,3,5,2,2.0,2.0,4.0,3.0,3.0,3.0,5.0,2.0,24.0,1.0,0.0,0.0,0.0,0.0,1.0,24.0,2.0
2021-03-25,34.0,2.0,1.0,2.0,22.0,1.0,3.0,1.0,2.0,,,,,,,,,,,1,1,,1.0,2,2,2,,1,4,4,3,2,3,1,5,1.0,4.0,4.0,3.0,2.0,3.0,1.0,5.0,23.0,1.0,1.0,1.0,1.0,2.0,2.0,23.0,2.0
2021-03-25,44.0,2.0,2.0,1.0,10.0,4.0,1.0,3.0,2.0,,,,,,,,,,,1,4,8,3.0,2,2,1,1,1,3,3,3,3,3,2,2,1.0,3.0,3.0,3.0,3.0,3.0,2.0,2.0,20.0,1.0,0.0,,0.0,0.0,1.0,20.0,3.0
2021-03-25,47.0,2.0,1.0,1.0,21.0,1.0,1.0,1.0,1.0,1,1,1,2.00,1.00,1.00,1.00,2.00,1.00,2.00,,,,1.0,1,2,2,,5,5,2,5,5,5,5,5,5.0,5.0,2.0,5.0,5.0,5.0,5.0,5.0,37.0,2.0,1.0,,1.0,2.0,2.0,37.0,3.0
2021-03-25,38.0,2.0,1.0,1.0,21.0,1.0,1.0,1.0,1.0,1,2,,,,,,,,,,,,1.0,1,2,2,,5,5,4,5,5,5,5,1,5.0,5.0,4.0,5.0,5.0,5.0,5.0,1.0,35.0,2.0,1.0,,1.0,2.0,2.0,35.0,2.0
2021-03-25,54.0,2.0,1.0,1.0,22.0,1.0,2.0,1.0,2.0,,,,,,,,,,,1,1,,1.0,1,2,2,,3,3,3,4,4,4,5,2,3.0,3.0,3.0,4.0,4.0,4.0,5.0,2.0,28.0,1.0,1.0,1.0,1.0,2.0,2.0,28.0,3.0
2021-03-25,44.0,2.0,2.0,1.0,9.0,2.0,1.0,3.0,2.0,,,,,,,,,,,3,7,8,3.0,1,2,1,5,2,3,4,4,4,3,5,1,2.0,3.0,4.0,4.0,4.0,3.0,5.0,1.0,26.0,1.0,0.0,,0.0,0.0,1.0,26.0,3.0
2021-03-25,41.0,2.0,4.0,1.0,23.0,4.0,1.0,3.0,2.0,,,,,,,,,,,3,7,8,3.0,1,1,2,,2,2,5,4,3,3,5,1,2.0,2.0,5.0,4.0,3.0,3.0,5.0,1.0,25.0,1.0,0.0,,0.0,0.0,1.0,25.0,3.0
2021-03-25,26.0,2.0,3.0,2.0,13.0,6.0,1.0,2.0,2.0,,,,,,,,,,,3,6,8,3.0,2,2,2,,2,2,3,2,3,3,4,2,2.0,2.0,3.0,2.0,3.0,3.0,4.0,2.0,21.0,1.0,0.0,,0.0,0.0,1.0,21.0,2.0
2021-03-25,44.0,2.0,1.0,2.0,22.0,1.0,6.0,1.0,2.0,,,,,,,,,,,1,1,,1.0,1,2,2,,1,5,1,4,4,5,5,1,1.0,5.0,1.0,4.0,4.0,5.0,5.0,1.0,26.0,1.0,1.0,1.0,1.0,2.0,2.0,26.0,3.0
2021-03-25,45.0,2.0,1.0,1.0,21.0,1.0,6.0,1.0,1.0,1,1,1,2.00,2.00,2.00,1.00,2.00,2.00,2.00,,,,1.0,1,2,2,,3,3,4,4,3,4,2,2,3.0,3.0,4.0,4.0,3.0,4.0,2.0,2.0,25.0,1.0,1.0,,1.0,2.0,2.0,25.0,3.0
2021-03-25,39.0,2.0,1.0,2.0,21.0,1.0,6.0,1.0,1.0,,1,1,2.00,2.00,2.00,2.00,2.00,2.00,2.00,,,,1.0,1,1,2,,4,4,4,2,4,4,5,4,4.0,4.0,4.0,2.0,4.0,4.0,5.0,4.0,31.0,2.0,1.0,,1.0,2.0,2.0,31.0,2.0
2021-03-25,50.0,1.0,1.0,1.0,22.0,1.0,4.0,3.0,2.0,,,,,,,,,,,3,3,2,1.0,2,2,3,,1,1,3,3,3,2,3,1,1.0,1.0,3.0,3.0,3.0,2.0,3.0,1.0,17.0,1.0,0.0,0.0,1.0,1.0,1.0,17.0,3.0
2021-03-25,29.0,1.0,1.0,1.0,19.0,1.0,5.0,3.0,2.0,,,,,,,,,,,3,3,2,1.0,2,2,3,,3,4,4,1,4,4,4,1,3.0,4.0,4.0,1.0,4.0,4.0,4.0,1.0,25.0,1.0,0.0,0.0,1.0,1.0,1.0,25.0,2.0
2021-03-25,28.0,1.0,1.0,2.0,15.0,4.0,3.0,1.0,1.0,1,1,1,2.00,2.00,2.00,1.00,2.00,2.00,2.00,,,,1.0,1,2,2,,3,4,4,1,4,4,4,2,3.0,4.0,4.0,1.0,4.0,4.0,4.0,2.0,26.0,1.0,1.0,,1.0,2.0,2.0,26.0,2.0
2021-03-25,32.0,1.0,1.0,2.0,15.0,4.0,3.0,2.0,2.0,,,,,,,,,,,3,6,8,1.0,1,2,2,,1,5,4,4,2,4,1,1,1.0,5.0,4.0,4.0,2.0,4.0,1.0,1.0,22.0,1.0,0.0,,1.0,1.0,1.0,22.0,2.0
2021-03-25,43.0,2.0,1.0,1.0,21.0,1.0,6.0,1.0,1.0,1,2,,,,,,,,,,,,1.0,1,1,2,,4,4,2,4,4,4,5,2,4.0,4.0,2.0,4.0,4.0,4.0,5.0,2.0,29.0,2.0,1.0,,1.0,2.0,2.0,29.0,3.0
2021-03-25,29.0,2.0,1.0,1.0,22.0,1.0,2.0,1.0,2.0,,,,,,,,,,,1,3,2,1.0,1,2,2,,1,4,1,5,4,5,5,5,1.0,4.0,1.0,5.0,4.0,5.0,5.0,5.0,30.0,2.0,1.0,0.0,1.0,2.0,2.0,30.0,2.0
2021-03-25,28.0,2.0,1.0,1.0,16.0,1.0,3.0,1.0,1.0,1,2,,,,,,,,,,,,1.0,1,1,2,,3,3,3,3,3,3,5,1,3.0,3.0,3.0,3.0,3.0,3.0,5.0,1.0,24.0,1.0,1.0,,1.0,2.0,2.0,24.0,2.0